BDBM50409629 CHEMBL348653
SMILES Clc1ccc(cc1Cl)C1(CCN2CC(C2)N2CCOCC2)CCC(=O)N(Cc2ccccc2)C1
InChI Key InChIKey=DFLDMBIKJAVZHG-UHFFFAOYSA-N
Data  1 Kd
  Tab Delimited (TSV)   2D SDfile   Computed 3D by Vconf -m prep SDfile
Find this compound or compounds like it in BindingDB:
Activity Spreadsheet -- Enzyme Inhibition Constant Data from BindingDB
Found 3 hits for monomerid = 50409629
TargetPoly [ADP-ribose] polymerase tankyrase-1(Homo sapiens (Human))TBA
LigandPNGBDBM50409629(CHEMBL5269897)
Affinity DataIC50:  1.90nM. Assay description: Inhibitory activity against dihydrofolate reductase (DHFR) of Neisseria gonorrhoea
In DepthDetails
TargetPoly [ADP-ribose] polymerase 1(Homo sapiens (Human))TBA
LigandPNGBDBM50409629(CHEMBL5269897)
Affinity DataIC50:  450nM. Assay description: Inhibitory activity against dihydrofolate reductase (DHFR) of Neisseria gonorrhoea
In DepthDetails
TargetPoly [ADP-ribose] polymerase tankyrase-2(Homo sapiens (Human))TBA
LigandPNGBDBM50409629(CHEMBL5269897)
Affinity DataIC50:  2.90nM. Assay description: Inhibitory activity against dihydrofolate reductase (DHFR) from Escherichia coli
In DepthDetails