BDBM50409986 CHEMBL190919
SMILES CCC(C)c1cc(-c2n[nH]c(C)c2-c2ccc3OCCOc3c2)c(O)cc1O
InChI Key InChIKey=HAXQIXZGORUPQK-UHFFFAOYSA-N
Data  1 IC50
  Tab Delimited (TSV)   2D SDfile   Computed 3D by Vconf -m prep SDfile
Find this compound or compounds like it in BindingDB:
Activity Spreadsheet -- Enzyme Inhibition Constant Data from BindingDB
Found 1 hit for monomerid = 50409986
TargetATP-dependent molecular chaperone HSP82(Saccharomyces cerevisiae)
The Institute Of Cancer Research
Curated by ChEMBL
LigandPNGBDBM50409986(CHEMBL190919)
Affinity DataIC50:  4.61E+4nM. Assay description: Inhibition of yeast Hsp90 ATPase activity
In DepthDetails ArticlePubMed