BDBM50410034 CHEMBL181166
SMILES CNc1cccc(c1)N1[C@H](CCc2ccccc2)[C@@H](O)[C@@H](Cc2ccccc2)N(C1=O)c1cccc(NC)c1
InChI Key InChIKey=ADJAFFUBCICGDS-XWHIBYANSA-N
Data  1 KI
  Tab Delimited (TSV)   2D SDfile   Computed 3D by Vconf -m prep SDfile
Find this compound or compounds like it in BindingDB:
Activity Spreadsheet -- Enzyme Inhibition Constant Data from BindingDB
Found 1 hit for monomerid = 50410034
TargetGag-Pol polyprotein [489-587](Human immunodeficiency virus type 1)
Clarkson University
Curated by ChEMBL
LigandPNGBDBM50410034(CHEMBL181166)
Affinity DataKi:  4.90nM. Assay description: Antiviral activity potency was assessed by measuring effect on the accumulation of viral RNA transcripts 3 days after infection of MT-2 cells with HI...
In DepthDetails ArticlePubMed