BDBM50410123 CHEMBL180094
SMILES CC(C)N(CCNC(=O)C1N(CCc2cc(Oc3ccccc3)ccc12)C(=O)OC(C)(C)C)C(C)C
InChI Key InChIKey=DIXGAFGOLYBWGT-UHFFFAOYSA-N
Data  4 EC50
  Tab Delimited (TSV)   2D SDfile   Computed 3D by Vconf -m prep SDfile
Find this compound or compounds like it in BindingDB:
Activity Spreadsheet -- Enzyme Inhibition Constant Data from BindingDB
Found 4 hits for monomerid = 50410123
TargetGrowth hormone secretagogue receptor type 1(Homo sapiens (Human))
Bristol-Myers Squibb Pharmaceutical Research Institute
Curated by ChEMBL
LigandPNGBDBM50410123(CHEMBL180094)
Affinity DataEC50:  0.460nM. Assay description: In vivo effective concentration against human growth hormone secretagogues
In DepthDetails ArticlePubMed
TargetGrowth hormone secretagogue receptor type 1(Homo sapiens (Human))
Bristol-Myers Squibb Pharmaceutical Research Institute
Curated by ChEMBL
LigandPNGBDBM50410123(CHEMBL180094)
Affinity DataEC50:  0.460nM. Assay description: In vitro effective concentration against human growth hormone secretagogues
In DepthDetails ArticlePubMed
TargetGrowth hormone secretagogue receptor type 1(Homo sapiens (Human))
Bristol-Myers Squibb Pharmaceutical Research Institute
Curated by ChEMBL
LigandPNGBDBM50410123(CHEMBL180094)
Affinity DataEC50:  0.490nM. Assay description: In vitro effective concentration against human growth hormone secretagogues
In DepthDetails ArticlePubMed
TargetGrowth hormone secretagogue receptor type 1(Homo sapiens (Human))
Bristol-Myers Squibb Pharmaceutical Research Institute
Curated by ChEMBL
LigandPNGBDBM50410123(CHEMBL180094)
Affinity DataEC50:  0.490nM. Assay description: In vitro effective concentration against human growth hormone secretagogues
In DepthDetails ArticlePubMed