BDBM50410293 CHEMBL195321
SMILES COc1ccc(CCNC(=O)c2ccc3N(C(C)=O)C(C)(C)CC(C)(c4ccccc4)c3c2)cc1
InChI Key InChIKey=LRYZMVUWQKWISQ-UHFFFAOYSA-N
Data  1 IC50
  Tab Delimited (TSV)   2D SDfile   Computed 3D by Vconf -m prep SDfile
Find this compound or compounds like it in BindingDB:
Activity Spreadsheet -- Enzyme Inhibition Constant Data from BindingDB
Found 1 hit for monomerid = 50410293
TargetFollicle-stimulating hormone receptor(Homo sapiens (Human))
Research And Development
Curated by ChEMBL
LigandPNGBDBM50410293(CHEMBL195321)
Affinity DataIC50:  1.88E+3nM. Assay description: In vitro inhibition of maximum response on CHO-K1 cells expressing human Follicle stimulating hormone receptor
In DepthDetails ArticlePubMed