BDBM50410991 CHEMBL2113236
SMILES O=C1O[C@@]2(CN1c1ccc3OCOc3c1)CN1CCC2CC1
InChI Key InChIKey=VYQNRDNWSFGCNC-MRXNPFEDSA-N
Data  1 IC50
  Tab Delimited (TSV)   2D SDfile   Computed 3D by Vconf -m prep SDfile
Find this compound or compounds like it in BindingDB:
Activity Spreadsheet -- Enzyme Inhibition Constant Data from BindingDB
Found 1 hit for monomerid = 50410991
TargetCytochrome P450 2D6(Homo sapiens (Human))
Mitsubishi Pharma
Curated by ChEMBL
LigandPNGBDBM50410991(CHEMBL2113236)
Affinity DataIC50: >3.00E+4nM. Assay description: Inhibition of CYP2D6
In DepthDetails ArticlePubMed