BDBM50411003 CHEMBL536973
SMILES NCCCC[C@H](NC(=O)C1CCOC1)C(=O)c1noc(Cc2ccc(OCCc3ccc(Cl)c(Cl)c3)cc2)n1
InChI Key InChIKey=NOWGVPLKMRUKNK-JWIMYKKASA-N
Data  1 KI
  Tab Delimited (TSV)   2D SDfile   Computed 3D by Vconf -m prep SDfile
Find this compound or compounds like it in BindingDB:
Activity Spreadsheet -- Enzyme Inhibition Constant Data from BindingDB
Found 1 hit for monomerid = 50411003
TargetTryptase beta-2(Homo sapiens (Human))
Celera Genomics
Curated by ChEMBL
LigandPNGBDBM50411003(CHEMBL536973)
Affinity DataKi:  22nM. Assay description: Inhibition of human B tryptase
In DepthDetails ArticlePubMed