BDBM50411086 CHEMBL378692
SMILES CCCC(CCC)CCC[C@@H](O)[C@H]1CC[C@@H](O1)[C@H]1CC[C@@H](O1)[C@H](O)CCCC(CCC)CCC
InChI Key InChIKey=OHDLANLNZSXUNZ-VHNXJUCRSA-N
Data  1 IC50
  Tab Delimited (TSV)   2D SDfile   Computed 3D by Vconf -m prep SDfile
Find this compound or compounds like it in BindingDB:
Activity Spreadsheet -- Enzyme Inhibition Constant Data from BindingDB
Found 1 hit for monomerid = 50411086
TargetAcyl carrier protein, mitochondrial(Bos taurus)
Kyoto University
Curated by ChEMBL
LigandPNGBDBM50411086(CHEMBL378692)
Affinity DataIC50:  1.50E+3nM. Assay description: Inhibition of bovine mitochondrial NADH-ubiquinone oxidoreductase by NADH oxidase assay
In DepthDetails ArticlePubMed