BDBM50411210 CHEMBL481977
SMILES Cc1cc(cnc1Cl)N1CC[C@@H]2CN[C@@H]2C1
InChI Key InChIKey=NYHCAFZZTFTEHK-MWLCHTKSSA-N
Data  3 EC50
  Tab Delimited (TSV)   2D SDfile   Computed 3D by Vconf -m prep SDfile
Find this compound or compounds like it in BindingDB:
Activity Spreadsheet -- Enzyme Inhibition Constant Data from BindingDB
Found 3 hits for monomerid = 50411210
TargetNeuronal acetylcholine receptor subunit alpha-4/beta-2(Homo sapiens (Human))
Abbott Laboratories
Curated by ChEMBL
LigandPNGBDBM50411210(CHEMBL481977)
Affinity DataEC50:  47nM. Assay description: Agonist activity at human alpha4beta2 ACHR expressed in HEK293 cells assessed as change in intracellular calcium concentration by FLIPR
In DepthDetails ArticlePubMed
TargetNeuronal acetylcholine receptor subunit alpha-3(Homo sapiens (Human))
Burnham Institute For Medical Research
Curated by ChEMBL
LigandPNGBDBM50411210(CHEMBL481977)
Affinity DataEC50:  70.8nM. Assay description: Agonist activity against human alpha3beta4 nAChR
In DepthDetails ArticlePubMed
TargetNeuronal acetylcholine receptor subunit alpha-4(Homo sapiens (Human))
Burnham Institute For Medical Research
Curated by ChEMBL
LigandPNGBDBM50411210(CHEMBL481977)
Affinity DataEC50:  46.8nM. Assay description: Agonist activity against human alpha4beta2 nAChR
In DepthDetails ArticlePubMed