BDBM50411347 CHEMBL226620
SMILES OC(=O)c1cccc(NC(=O)CN2N=C(C3CCCCC3)c3ccccc3N(CC(=O)C3CCCC3)C2=O)c1
InChI Key InChIKey=YMDDEXCAAGMUQT-UHFFFAOYSA-N
Data  3 KI
  Tab Delimited (TSV)   2D SDfile   Computed 3D by Vconf -m prep SDfile
Find this compound or compounds like it in BindingDB:
Activity Spreadsheet -- Enzyme Inhibition Constant Data from BindingDB
Found 3 hits for monomerid = 50411347
TargetGastrin/cholecystokinin type B receptor(Homo sapiens (Human))
James Black Foundation
Curated by ChEMBL
LigandPNGBDBM50411347(CHEMBL226620)
Affinity DataKi:  1nM. Assay description: Displacement of [3H]BH-CCK-8S from human recombinant CCK2 receptor expressed in NIH3T3 cellsChecked by Author
In DepthDetails ArticlePubMed
TargetGastrin/cholecystokinin type B receptor(Dog)
James Black Foundation
Curated by ChEMBL
LigandPNGBDBM50411347(CHEMBL226620)
Affinity DataKi:  7.10nM. Assay description: Displacement of [125I]BH-CCK8-8S from CCK2 receptor in canine gastric mucosaChecked by Author
In DepthDetails ArticlePubMed
TargetCholecystokinin receptor type A(Homo sapiens (Human))
James Black Foundation
Curated by ChEMBL
LigandPNGBDBM50411347(CHEMBL226620)
Affinity DataKi: <1.00E+4nM. Assay description: Displacement of [3H]L-364718 from human recombinant CCK1 receptor expressed in PC3 cellsChecked by Author
In DepthDetails ArticlePubMed