BDBM50411431 CHEMBL393717
SMILES Clc1ccc(cc1C(=O)NCC12CC3CC(CC(C3)C1)C2)N1CCNCC1
InChI Key InChIKey=SZEATWKNDKWXLO-UHFFFAOYSA-N
Data  1 IC50
  Tab Delimited (TSV)   2D SDfile   Computed 3D by Vconf -m prep SDfile
Find this compound or compounds like it in BindingDB:
Activity Spreadsheet -- Enzyme Inhibition Constant Data from BindingDB
Found 1 hit for monomerid = 50411431
TargetP2X purinoceptor 7(Rattus norvegicus (Rat))
Astrazeneca R&D Charnwood
Curated by ChEMBL
LigandPNGBDBM50411431(CHEMBL393717)
Affinity DataIC50:  1.26E+3nM. Assay description: Antagonist activity at rat P2X7 receptor transfected in HEK cells assessed as inhibition of benzylATP-induced changes in plasma membrane pore formati...
In DepthDetails ArticlePubMed