BDBM50411472 CHEMBL1162049
SMILES CC(=O)NS(=O)(=O)OC[C@H]1O[C@H]([C@H](O)[C@@H]1O)n1cnc2c(N)ncnc12
InChI Key InChIKey=SKYBLZMECJREBK-WOUKDFQISA-N
Data  1 KI
PDB links: 1 PDB ID matches this monomer.
  Tab Delimited (TSV)   2D SDfile   Computed 3D by Vconf -m prep SDfile
Find this compound or compounds like it in BindingDB:
Activity Spreadsheet -- Enzyme Inhibition Constant Data from BindingDB
Found 1 hit for monomerid = 50411472
TargetSalicyl-AMP ligase / salicyl-S-ArCP synthetase(Mycobacterium tuberculosis)
University Of Minnesota
Curated by ChEMBL
LigandPNGBDBM50411472(CHEMBL1162049)
Affinity DataKi: >1.00E+5nM. Assay description: Inhibition of Mycobacterium tuberculosis recombinant MbtA expressed in Escherichia coli by ATP/PPi exchange assay
In DepthDetails ArticlePubMed