BDBM50411905 CHEMBL272733
SMILES COc1nc(CC=C(C)C\C=C\C(\C)=C\[C@@H](C)[C@@H](O)C(\C)=C\C)c(C)c(O)c1OC
InChI Key InChIKey=BBLGCDSLCDDALX-PWLUOXNBSA-N
Data  2 IC50  2 Kd
  Tab Delimited (TSV)   2D SDfile   Computed 3D by Vconf -m prep SDfile
Find this compound or compounds like it in BindingDB:
Activity Spreadsheet -- Enzyme Inhibition Constant Data from BindingDB
Found 4 hits for monomerid = 50411905
TargetAcyl carrier protein, mitochondrial(Bos taurus)
Georg-August-Universit£T G£Ttingen
Curated by ChEMBL
LigandPNGBDBM50411905(CHEMBL272733)
Affinity DataIC50:  5nM. Assay description: Inhibition of NADH-ubiquinone oxidoreductase assessed as NADH oxidase activity in bovine heart submitochondrial particles
In DepthDetails ArticlePubMed
TargetOxysterols receptor LXR-alpha(Homo sapiens (Human))
Southern Medical University
Curated by ChEMBL
LigandPNGBDBM50411905(CHEMBL272733)
Affinity DataKd:  3.24E+3nM. Assay description: Binding affinity to full-length human LXRalpha by surface plasmon resonance assay
In DepthDetails ArticlePubMed
TargetPeroxiredoxin-1(Homo sapiens)
Chinese Academy Of Sciences
Curated by ChEMBL
LigandPNGBDBM50411905(CHEMBL272733)
Affinity DataKd:  2.61E+3nM. Assay description: Binding affinity to full-length human PRDX1 by surface plasmon resonance analysis
In DepthDetails ArticlePubMed
TargetNADH-ubiquinone oxidoreductase chain 1(Bos taurus (Bovine))
Kyoto University
Curated by ChEMBL
LigandPNGBDBM50411905(CHEMBL272733)
Affinity DataIC50:  3nM. Assay description: Inhibition of Bos taurus (bovine) mitochondrial complex 1 assessed as reduction in enzyme activity by NADH-HU oxidoreductase assay
In DepthDetails ArticlePubMed