BDBM50412352 CHEMBL488883
SMILES CCCCc1nc2cc(NC(=O)c3ccc(Cl)cc3)ccc2n1Cc1ccc(cc1)-c1ccccc1C(O)=O
InChI Key InChIKey=PXBAOTYXWNQOAM-UHFFFAOYSA-N
Data  1 Kd
PDB links: 1 PDB ID matches this monomer.
  Tab Delimited (TSV)   2D SDfile   Computed 3D by Vconf -m prep SDfile
Find this compound or compounds like it in BindingDB:
Activity Spreadsheet -- Enzyme Inhibition Constant Data from BindingDB
Found 7 hits for monomerid = 50412352
TargetUbiquitin carboxyl-terminal hydrolase 5(Homo sapiens (Human))TBA
LigandPNGBDBM50412352(CHEMBL5278336)
Affinity DataKd:  2.80E+3nM. Assay description: Binding affinity to Human immunodeficiency virus 1 reverse transcriptase
In DepthDetails PDB3D3D Structure (crystal)
TargetHistone deacetylase 6(Homo sapiens (Human))TBA
LigandPNGBDBM50412352(CHEMBL5278336)
Affinity DataKd:  1.10E+5nM. Assay description: Inhibition of AChE in organophosphate-resistant clone of Schizaphis graminum OR2 adult or last-instar nymphs homogenates assessed as bimolecular rate...
In DepthDetails
TargetUbiquitin carboxyl-terminal hydrolase 5(Homo sapiens (Human))TBA
LigandPNGBDBM50412352(CHEMBL5278336)
Affinity DataKd:  8.00E+3nM. Assay description: Inhibition of AChE in organophosphate-resistant clone of Schizaphis graminum OR1 adult or last-instar nymphs homogenates assessed as bimolecular rate...
In DepthDetails PDB3D3D Structure (crystal)
TargetUbiquitin carboxyl-terminal hydrolase 5(Homo sapiens (Human))TBA
LigandPNGBDBM50412352(CHEMBL5278336)
Affinity DataIC50:  800nM. Assay description: Inhibition of AChE in organophosphate-susceptible clone of Schizaphis graminum OSS adult or last-instar nymphs homogenates assessed as bimolecular ra...
In DepthDetails PDB3D3D Structure (crystal)
TargetUbiquitin carboxyl-terminal hydrolase 5(Homo sapiens (Human))TBA
LigandPNGBDBM50412352(CHEMBL5278336)
Affinity DataIC50:  7.00E+3nM. Assay description: Inhibition of AChE in organophosphate-resistant clone of Schizaphis graminum OR1 adult or last-instar nymphs homogenates assessed as bimolecular rate...
In DepthDetails PDB3D3D Structure (crystal)
TargetUbiquitin carboxyl-terminal hydrolase 5(Homo sapiens (Human))TBA
LigandPNGBDBM50412352(CHEMBL5278336)
Affinity DataIC50:  2.60E+4nM. Assay description: Inhibition of AChE in organophosphate-susceptible clone of Schizaphis graminum OSS adult or last-instar nymphs homogenates assessed as bimolecular ra...
In DepthDetails PDB3D3D Structure (crystal)
TargetUbiquitin carboxyl-terminal hydrolase 5(Homo sapiens (Human))TBA
LigandPNGBDBM50412352(CHEMBL5278336)
Affinity DataIC50:  4.60E+4nM. Assay description: Inhibition of AChE in organophosphate-resistant clone of Schizaphis graminum OR1 adult or last-instar nymphs homogenates assessed as bimolecular rate...
In DepthDetails PDB3D3D Structure (crystal)