BDBM50412361 CHEMBL1627105
SMILES Nc1nc(nc2n(cnc12)[C@@H]1O[C@H](COS(=O)(=O)[N-]C(=O)c2ccccc2O)[C@@H](O)[C@H]1O)-c1cccc(c1)-c1ccccc1
InChI Key InChIKey=UUMZDHZILVETOE-LQLFOZJWSA-M
Data  1 KI
  Tab Delimited (TSV)   2D SDfile   Computed 3D by Vconf -m prep SDfile
Find this compound or compounds like it in BindingDB:
Activity Spreadsheet -- Enzyme Inhibition Constant Data from BindingDB
Found 1 hit for monomerid = 50412361
TargetSalicyl-AMP ligase / salicyl-S-ArCP synthetase(Mycobacterium tuberculosis)
University Of Minnesota
Curated by ChEMBL
LigandPNGBDBM50412361(CHEMBL1627105)
Affinity DataKi:  1.40nM. Assay description: Inhibition of Mycobacterium tuberculosis recombinant MbtA expressed in Escherichia coli by ATP-PPi exchange assay
In DepthDetails ArticlePubMed