BDBM50412486 CHEMBL461732
SMILES CNc1nc(nc2ccc(Cl)cc12)N1CC[C@@H](N)C1
InChI Key InChIKey=CMOWYBWYCJHODO-SECBINFHSA-N
Data  1 KI
  Tab Delimited (TSV)   2D SDfile   Computed 3D by Vconf -m prep SDfile
Find this compound or compounds like it in BindingDB:
Activity Spreadsheet -- Enzyme Inhibition Constant Data from BindingDB
Found 1 hit for monomerid = 50412486
TargetHistamine H4 receptor(Homo sapiens (Human))
Vrije Universiteit Amsterdam
Curated by ChEMBL
LigandPNGBDBM50412486(CHEMBL461732)
Affinity DataKi: >1.00E+3nM. Assay description: Displacement of [3H]histamine from human histamine H4 receptor expressed in HEK cells
In DepthDetails ArticlePubMed