BDBM50412507 CHEMBL510181
SMILES CCOC(=O)CNc1nc(nc2ccc(Cl)cc12)N1CCN(C)CC1
InChI Key InChIKey=KZOYWPDAGQIBCG-UHFFFAOYSA-N
Data  2 KI
  Tab Delimited (TSV)   2D SDfile   Computed 3D by Vconf -m prep SDfile
Find this compound or compounds like it in BindingDB:
Activity Spreadsheet -- Enzyme Inhibition Constant Data from BindingDB
Found 2 hits for monomerid = 50412507
TargetHistamine H4 receptor(Homo sapiens (Human))
Griffin Discoveries
Curated by ChEMBL
LigandPNGBDBM50412507(CHEMBL510181)
Affinity DataKi:  891nM. Assay description: Displacement of [3H]histamine from human histamine H4 receptor expressed in HEK293T cells
In DepthDetails ArticlePubMed
TargetHistamine H4 receptor(Homo sapiens (Human))
Griffin Discoveries
Curated by ChEMBL
LigandPNGBDBM50412507(CHEMBL510181)
Affinity DataKi:  955nM. Assay description: Displacement of [3H]histamine from human histamine H4 receptor expressed in HEK cells
In DepthDetails ArticlePubMed