BDBM50412715 CHEMBL494503
SMILES CC(=NNC(=O)[C@H]1[C@@H](CNC1=O)c1ccccc1)c1ccc(Br)cc1
InChI Key InChIKey=VOKHQMXJGNNEBL-IRXDYDNUSA-N
Data  1 EC50
  Tab Delimited (TSV)   2D SDfile   Computed 3D by Vconf -m prep SDfile
Find this compound or compounds like it in BindingDB:
Activity Spreadsheet -- Enzyme Inhibition Constant Data from BindingDB
Found 1 hit for monomerid = 50412715
TargetProteinase-activated receptor 2(Homo sapiens (Human))
Acadia Pharmaceuticals
Curated by ChEMBL
LigandPNGBDBM50412715(CHEMBL494503)
Affinity DataEC50:  7.94E+3nM. Assay description: Agonist activity at human PAR2 expressed in HEK293T cells assessed as effect on intracellular calcium mobilization by R-SAT assay
In DepthDetails ArticlePubMed