BDBM50412856 CHEMBL185219
SMILES CC1(C)OC[C@H](NC(=O)Nc2c(Cl)cccc2Cl)[C@@H](O1)c1ccccc1
InChI Key InChIKey=QFCGCVSSBVHZEP-RDJZCZTQSA-N
Data  4 KI
  Tab Delimited (TSV)   2D SDfile   Computed 3D by Vconf -m prep SDfile
Find this compound or compounds like it in BindingDB:
Activity Spreadsheet -- Enzyme Inhibition Constant Data from BindingDB
Found 4 hits for monomerid = 50412856
TargetOrexin/Hypocretin receptor type 1(Homo sapiens (Human))
Actelion Pharmaceuticals
Curated by ChEMBL
LigandPNGBDBM50412856(CHEMBL185219)
Affinity DataKi: >5.01E+3nM. Assay description: Binding affinity to OX1 receptor
In DepthDetails ArticlePubMed
TargetOrexin receptor type 2(Homo sapiens (Human))
Johnson And Johnson Pharmaceutical Research And Development
Curated by ChEMBL
LigandPNGBDBM50412856(CHEMBL185219)
Affinity DataKi: <5.01E+3nM. Assay description: Binding affinity towards human orexin receptor type 2 was determined using [125I]-Orexin A as radio ligand
In DepthDetails ArticlePubMed
TargetOrexin/Hypocretin receptor type 1(Homo sapiens (Human))
Actelion Pharmaceuticals
Curated by ChEMBL
LigandPNGBDBM50412856(CHEMBL185219)
Affinity DataKi: <1.00E+4nM. Assay description: Binding affinity towards human orexin receptor type 1 was determined using [125I]-Orexin A as radio ligand
In DepthDetails ArticlePubMed
TargetOrexin receptor type 2(Homo sapiens (Human))
Johnson And Johnson Pharmaceutical Research And Development
Curated by ChEMBL
LigandPNGBDBM50412856(CHEMBL185219)
Affinity DataKi: >1.00E+4nM. Assay description: Binding affinity to OX2 receptor
In DepthDetails ArticlePubMed