BDBM50412961 CHEMBL521264
SMILES N[C@@H]1CCN(C1)C(=O)[C@@H]1CCCCN1S(=O)(=O)c1ccc(Br)cc1
InChI Key InChIKey=VCIQCNZAYARWAK-HIFRSBDPSA-N
Data  1 EC50
  Tab Delimited (TSV)   2D SDfile   Computed 3D by Vconf -m prep SDfile
Find this compound or compounds like it in BindingDB:
Activity Spreadsheet -- Enzyme Inhibition Constant Data from BindingDB
Found 1 hit for monomerid = 50412961
TargetGrowth hormone secretagogue receptor type 1(Homo sapiens (Human))
Glaxosmithkline
Curated by ChEMBL
LigandPNGBDBM50412961(CHEMBL521264)
Affinity DataEC50:  398nM. Assay description: Agonist activity at human ghrelin receptor by cell based BACMAM FLIPR assay
In DepthDetails ArticlePubMed