BDBM50413108 CHEMBL540145
SMILES CC(C)OC(=O)c1ccc(NC(=O)N[C@@H](Cc2ccc(O)cc2)C(=O)N[C@H]2CCC[N+](CC=C)(Cc3cccc(O)c3)C2)cc1
InChI Key InChIKey=JFEFOFYHVIMFRD-AIOAALFSSA-O
Data  3 Kd
  Tab Delimited (TSV)   2D SDfile   Computed 3D by Vconf -m prep SDfile
Find this compound or compounds like it in BindingDB:
Activity Spreadsheet -- Enzyme Inhibition Constant Data from BindingDB
Found 3 hits for monomerid = 50413108
TargetMuscarinic acetylcholine receptor M2(Homo sapiens (Human))
Glaxosmithkline
Curated by ChEMBL
LigandPNGBDBM50413108(CHEMBL540145)
Affinity DataKd:  1.58nM. Assay description: Antagonist activity at human recombinant muscarinic M2 receptor expressed in CHO cells coexpressing chimeric G protein Gqi5 assessed as inhibition of...
In DepthDetails ArticlePubMed
TargetMuscarinic acetylcholine receptor M1(Homo sapiens (Human))
Glaxosmithkline
Curated by ChEMBL
LigandPNGBDBM50413108(CHEMBL540145)
Affinity DataKd:  15.8nM. Assay description: Antagonist activity at human recombinant muscarinic M1 receptor expressed in CHO cells assessed as inhibition of acetylcholine-induced intracellular ...
In DepthDetails ArticlePubMed
TargetMuscarinic acetylcholine receptor M3(Homo sapiens (Human))
Glaxosmithkline
Curated by ChEMBL
LigandPNGBDBM50413108(CHEMBL540145)
Affinity DataKd:  0.100nM. Assay description: Antagonist activity at human recombinant muscarinic M3 receptor expressed in CHO cells assessed as inhibition of acetylcholine-induced intracellular ...
In DepthDetails ArticlePubMed