BDBM50413254 CHEMBL470588
SMILES CCCCCCCOc1ccc(cc1)-c1ccc(cc1)C(O)=O
InChI Key InChIKey=BDDYPNQQJHNKSC-UHFFFAOYSA-N
Data  1 EC50
  Tab Delimited (TSV)   2D SDfile   Computed 3D by Vconf -m prep SDfile
Find this compound or compounds like it in BindingDB:
Activity Spreadsheet -- Enzyme Inhibition Constant Data from BindingDB
Found 1 hit for monomerid = 50413254
TargetRetinoic acid receptor beta(Homo sapiens (Human))
Acadia Pharmaceuticals
Curated by ChEMBL
LigandPNGBDBM50413254(CHEMBL470588)
Affinity DataEC50:  63.1nM. Assay description: Agonist activity at RARbeta2 expressed in mouse NIH3T3 cells by R-SAT assay
In DepthDetails ArticlePubMed