BDBM50413350 CHEMBL492789
SMILES COc1cc(C(C)C)c(Oc2cncnc2N)cc1I
InChI Key InChIKey=UDGFSUIATFMOKQ-UHFFFAOYSA-N
Data  2 IC50
  Tab Delimited (TSV)   2D SDfile   Computed 3D by Vconf -m prep SDfile
Find this compound or compounds like it in BindingDB:
Activity Spreadsheet -- Enzyme Inhibition Constant Data from BindingDB
Found 2 hits for monomerid = 50413350
TargetP2X purinoceptor 2(Homo sapiens (Human))
Roche Palo Alto
Curated by ChEMBL
LigandPNGBDBM50413350(CHEMBL492789)
Affinity DataIC50:  1.59E+3nM. Assay description: Antagonist activity at human P2X2/3 receptor expressed in 1321n1c cells by FLIPR
In DepthDetails ArticlePubMed
TargetP2X purinoceptor 3(RAT)
Roche Palo Alto
Curated by ChEMBL
LigandPNGBDBM50413350(CHEMBL492789)
Affinity DataIC50:  398nM. Assay description: Antagonist activity at rat P2X3 receptor expressed in CHO cells by FLIPR
In DepthDetails ArticlePubMed