BDBM50413476 CHEMBL539886
SMILES C[C@H]1CN(Cc2cccc(c2)-c2cc(CNC(=O)c3cccc(CN4CC[N+]5(CCCCC5)CC4)c3)ccc2F)CCN1
InChI Key InChIKey=XFAMGCKVSKERDN-NDEPHWFRSA-O
Data  1 Kd
  Tab Delimited (TSV)   2D SDfile   Computed 3D by Vconf -m prep SDfile
Find this compound or compounds like it in BindingDB:
Activity Spreadsheet -- Enzyme Inhibition Constant Data from BindingDB
Found 1 hit for monomerid = 50413476
TargetMuscarinic acetylcholine receptor M3(Homo sapiens (Human))
Glaxosmithkline
Curated by ChEMBL
LigandPNGBDBM50413476(CHEMBL539886)
Affinity DataKd:  0.126nM. Assay description: Antagonist activity at human recombinant muscarinic M3 receptor expressed in CHO cells assessed as inhibition of acetylcholine-induced calcium mobili...
In DepthDetails ArticlePubMed