BDBM50414081 CHEMBL560150
SMILES Cc1cc(O)ccc1-c1ccc2\C(=C\c3ccc[nH]3)C(=O)Nc2c1
InChI Key InChIKey=KYKFGZLOKTVWJR-WQRHYEAKSA-N
Data  1 KI
  Tab Delimited (TSV)   2D SDfile   Computed 3D by Vconf -m prep SDfile
Find this compound or compounds like it in BindingDB:
Activity Spreadsheet -- Enzyme Inhibition Constant Data from BindingDB
Found 1 hit for monomerid = 50414081
TargetSerine/threonine-protein kinase Chk1(Homo sapiens (Human))
Abbott Laboratories
Curated by ChEMBL
LigandPNGBDBM50414081(CHEMBL560150)
Affinity DataKi:  158nM. Assay description: Inhibition of Chk1
In DepthDetails ArticlePubMed