BDBM50414207 CHEMBL555940
SMILES OC1CCN(C1)c1ccc(Cl)cc1NC(=O)Nc1cnc(cn1)C#N
InChI Key InChIKey=DJKQLDAFKZSMDQ-UHFFFAOYSA-N
Data  1 KI
  Tab Delimited (TSV)   2D SDfile   Computed 3D by Vconf -m prep SDfile
Find this compound or compounds like it in BindingDB:
Activity Spreadsheet -- Enzyme Inhibition Constant Data from BindingDB
Found 1 hit for monomerid = 50414207
TargetSerine/threonine-protein kinase Chk1(Homo sapiens (Human))
Abbott Laboratories
Curated by ChEMBL
LigandPNGBDBM50414207(CHEMBL555940)
Affinity DataKi:  5nM. Assay description: Inhibition of Chk1
In DepthDetails ArticlePubMed