BDBM50414543 CHEMBL550316
SMILES CN1CCOc2ccc(cc12)C(=O)Nc1nnc(s1)-c1c(C)cccc1C
InChI Key InChIKey=ISMPIWGQVLXSIX-UHFFFAOYSA-N
Data  1 KI
  Tab Delimited (TSV)   2D SDfile   Computed 3D by Vconf -m prep SDfile
Find this compound or compounds like it in BindingDB:
Activity Spreadsheet -- Enzyme Inhibition Constant Data from BindingDB
Found 1 hit for monomerid = 50414543
TargetProstaglandin E2 receptor EP3 subtype(Homo sapiens (Human))
Glaxosmithkline
Curated by ChEMBL
LigandPNGBDBM50414543(CHEMBL550316)
Affinity DataKi:  5.01nM. Assay description: Antagonist activity at human EP3 receptor expressed in cells assessed as mobilization of intracellular calcium by FLIPR assay
In DepthDetails ArticlePubMed