BDBM50414610 CHEMBL564160
SMILES CCN(CC(O)(CNc1cc(C)cc2n(ncc12)-c1ccc(F)cc1)C(F)(F)F)C(=O)c1ccccc1F
InChI Key InChIKey=SPHIVBVCYHSZNE-UHFFFAOYSA-N
Data  1 IC50
  Tab Delimited (TSV)   2D SDfile   Computed 3D by Vconf -m prep SDfile
Find this compound or compounds like it in BindingDB:
Activity Spreadsheet -- Enzyme Inhibition Constant Data from BindingDB
Found 1 hit for monomerid = 50414610
TargetGlucocorticoid receptor(Homo sapiens (Human))
Glaxosmithkline
Curated by ChEMBL
LigandPNGBDBM50414610(CHEMBL564160)
Affinity DataIC50:  0.200nM. Assay description: Agonist activity at GR in human A549 cells by NF-kappaB transrepression assay
In DepthDetails ArticlePubMed