BDBM50414612 CHEMBL559115
SMILES CCN(CC(O)(CNc1cccc2n(ncc12)-c1ccccc1)C(F)(F)F)C(=O)c1ccccc1F
InChI Key InChIKey=FEAJPHDPCSLTBK-UHFFFAOYSA-N
Data  1 IC50
  Tab Delimited (TSV)   2D SDfile   Computed 3D by Vconf -m prep SDfile
Find this compound or compounds like it in BindingDB:
Activity Spreadsheet -- Enzyme Inhibition Constant Data from BindingDB
Found 1 hit for monomerid = 50414612
TargetGlucocorticoid receptor(Homo sapiens (Human))
Glaxosmithkline
Curated by ChEMBL
LigandPNGBDBM50414612(CHEMBL559115)
Affinity DataIC50:  0.316nM. Assay description: Agonist activity at GR in human A549 cells by NF-kappaB transrepression assay
In DepthDetails ArticlePubMed