BDBM50414778 CHEMBL572392
SMILES CN(C)CCC(NC(=O)c1cccc(c1)-c1ccccc1)c1ccc(C)cc1
InChI Key InChIKey=BWJBNDNMEHLJIV-UHFFFAOYSA-N
Data  1 EC50
  Tab Delimited (TSV)   2D SDfile   Computed 3D by Vconf -m prep SDfile
Find this compound or compounds like it in BindingDB:
Activity Spreadsheet -- Enzyme Inhibition Constant Data from BindingDB
Found 1 hit for monomerid = 50414778
TargetUrotensin-2(Homo sapiens (Human))
University Of Gothenburg
Curated by ChEMBL
LigandPNGBDBM50414778(CHEMBL572392)
Affinity DataEC50:  813nM. Assay description: Agonist activity against human urotensin 2 receptor expressed in human NIH373 cells assessed as beta-galactosidase activity after 5 days by R-SAT ass...
In DepthDetails ArticlePubMed