BDBM50415876 CHEMBL1096703
SMILES COc1cc(\C=C\C(=O)N2CCSCC2)ccc1O
InChI Key InChIKey=NEXAVEHOUSBMGM-HWKANZROSA-N
Data  1 EC50
  Tab Delimited (TSV)   2D SDfile   Computed 3D by Vconf -m prep SDfile
Find this compound or compounds like it in BindingDB:
Activity Spreadsheet -- Enzyme Inhibition Constant Data from BindingDB
Found 1 hit for monomerid = 50415876
TargetTransient receptor potential cation channel subfamily V member 1(Homo sapiens (Human))
Universidad De Antioquia
Curated by ChEMBL
LigandPNGBDBM50415876(CHEMBL1096703)
Affinity DataEC50:  2.51nM. Assay description: Antagonist activity at human TRPV1 expressed in tetracycline-stimulated HEK293 cells assessed as inhibition of capsaicin-induced intracellular calciu...
In DepthDetails ArticlePubMed