BDBM50416296 CHEMBL1171208
SMILES OC(=O)c1ccccc1Oc1cccc(F)c1NS(=O)(=O)c1ccc(Cl)cc1
InChI Key InChIKey=DCIFJRWUJPIGHB-UHFFFAOYSA-N
Data  2 KI
  Tab Delimited (TSV)   2D SDfile   Computed 3D by Vconf -m prep SDfile
Find this compound or compounds like it in BindingDB:
Activity Spreadsheet -- Enzyme Inhibition Constant Data from BindingDB
Found 2 hits for monomerid = 50416296
TargetC-C chemokine receptor type 2(Mus musculus)
Glaxosmithkline
Curated by ChEMBL
LigandPNGBDBM50416296(CHEMBL1171208)
Affinity DataKi: >3.16E+3nM. Assay description: Antagonist activity at mouse CCR2
In DepthDetails ArticlePubMed
TargetC-C chemokine receptor type 2(Homo sapiens (Human))
Glaxosmithkline
Curated by ChEMBL
LigandPNGBDBM50416296(CHEMBL1171208)
Affinity DataKi: >3.16E+3nM. Assay description: Antagonist activity at human CCR2 expressed in CHO cells assessed as inhibition of MCP1-induced [35S]-GTPgammaS binding after 3 hrs
In DepthDetails ArticlePubMed