BDBM50416502 CHEMBL1209654
SMILES CCCCC[N+]1(CCC#Cc2cc(OC)c(OC)c(OC)c2)CCCCC1
InChI Key InChIKey=XBEQTCMAFQIDEF-UHFFFAOYSA-N
Data  1 KI
  Tab Delimited (TSV)   2D SDfile   Computed 3D by Vconf -m prep SDfile
Find this compound or compounds like it in BindingDB:
Activity Spreadsheet -- Enzyme Inhibition Constant Data from BindingDB
Found 1 hit for monomerid = 50416502
TargetHigh affinity choline transporter 1(Mus musculus)
Northeastern Ohio Universities Colleges Of Medicine And Pharmacy
Curated by ChEMBL
LigandPNGBDBM50416502(CHEMBL1209654)
Affinity DataKi:  20.0nM. Assay description: Inhibition of [3H]choline uptake at choline transporter 1 in mouse brain synaptosome
In DepthDetails ArticlePubMed