BDBM50416573 CHEMBL1221879
SMILES COc1nc2ccc(Br)cc2cc1[C@H](c1ccccc1)[C@@](O)(CCN(C)C)c1cccc2ccccc12
InChI Key InChIKey=QUIJNHUBAXPXFS-XDFJSJKPSA-N
Data  1 IC50
  Tab Delimited (TSV)   2D SDfile   Computed 3D by Vconf -m prep SDfile
Find this compound or compounds like it in BindingDB:
Activity Spreadsheet -- Enzyme Inhibition Constant Data from BindingDB
Found 1 hit for monomerid = 50416573
TargetATP synthase subunit c(Mycobacterium smegmatis)
Tibotec
Curated by ChEMBL
LigandPNGBDBM50416573(CHEMBL1221879)
Affinity DataIC50:  750nM. Assay description: Inhibition of Mycobacterium smegmatis ATCC 607 ATP synthase subunit c-mediated ATP synthesis after 60 mins by luminometry
In DepthDetails ArticlePubMed