BDBM50416683 CHEMBL1223125
SMILES CC(=O)NCCSc1ccccc1
InChI Key InChIKey=RSOVUTMFSIKQHH-UHFFFAOYSA-N
Data  2 KI
  Tab Delimited (TSV)   2D SDfile   Computed 3D by Vconf -m prep SDfile
Find this compound or compounds like it in BindingDB:
Activity Spreadsheet -- Enzyme Inhibition Constant Data from BindingDB
Found 2 hits for monomerid = 50416683
TargetMelatonin receptor type 1B(Homo sapiens (Human))
Universit£
Curated by ChEMBL
LigandPNGBDBM50416683(CHEMBL1223125)
Affinity DataKi:  339nM. Assay description: Displacement of [125I]iodomelatonin from human cloned MT2 receptor expressed in rat NIH3T3 cells after 90 mins
In DepthDetails ArticlePubMed
TargetMelatonin receptor type 1A(Homo sapiens (Human))
Universit£
Curated by ChEMBL
LigandPNGBDBM50416683(CHEMBL1223125)
Affinity DataKi:  3.80E+3nM. Assay description: Displacement of [125I]iodomelatonin from human cloned MT1 receptor expressed in rat NIH3T3 cells after 90 mins
In DepthDetails ArticlePubMed