BDBM50416688 CHEMBL1223053
SMILES COc1cccc(S[C@@H](C)CNC(C)=O)c1
InChI Key InChIKey=JXAUKESHFHRNAG-VIFPVBQESA-N
Data  4 KI
  Tab Delimited (TSV)   2D SDfile   Computed 3D by Vconf -m prep SDfile
Find this compound or compounds like it in BindingDB:
Activity Spreadsheet -- Enzyme Inhibition Constant Data from BindingDB
Found 4 hits for monomerid = 50416688
TargetMelatonin receptor type 1A(Homo sapiens (Human))
Universit£
Curated by ChEMBL
LigandPNGBDBM50416688(CHEMBL1223053)
Affinity DataKi:  5.75nM. Assay description: Displacement of [125I]iodomelatonin from human cloned MT1 receptor expressed in rat NIH3T3 cells after 90 mins
In DepthDetails ArticlePubMed
TargetMelatonin receptor type 1B(Homo sapiens (Human))
Universit£
Curated by ChEMBL
LigandPNGBDBM50416688(CHEMBL1223053)
Affinity DataKi:  7.08nM. Assay description: Displacement of [125I]iodomelatonin from human cloned MT2 receptor expressed in rat NIH3T3 cells after 90 mins
In DepthDetails ArticlePubMed
TargetMelatonin receptor type 1A(Homo sapiens (Human))
Universit£
Curated by ChEMBL
LigandPNGBDBM50416688(CHEMBL1223053)
Affinity DataKi:  110nM. Assay description: Displacement of [125I]iodomelatonin from human cloned MT1 receptor expressed in rat NIH3T3 cells after 90 mins
In DepthDetails ArticlePubMed
TargetMelatonin receptor type 1B(Homo sapiens (Human))
Universit£
Curated by ChEMBL
LigandPNGBDBM50416688(CHEMBL1223053)
Affinity DataKi:  263nM. Assay description: Displacement of [125I]iodomelatonin from human cloned MT2 receptor expressed in rat NIH3T3 cells after 90 mins
In DepthDetails ArticlePubMed