BDBM50416689 CHEMBL1223052
SMILES COc1cccc(S[C@H](C)CNC(C)=O)c1
InChI Key InChIKey=JXAUKESHFHRNAG-SECBINFHSA-N
Data  2 KI
  Tab Delimited (TSV)   2D SDfile   Computed 3D by Vconf -m prep SDfile
Find this compound or compounds like it in BindingDB:
Activity Spreadsheet -- Enzyme Inhibition Constant Data from BindingDB
Found 2 hits for monomerid = 50416689
TargetMelatonin receptor type 1B(Homo sapiens (Human))
Universit£
Curated by ChEMBL
LigandPNGBDBM50416689(CHEMBL1223052)
Affinity DataKi:  661nM. Assay description: Displacement of [125I]iodomelatonin from human cloned MT2 receptor expressed in rat NIH3T3 cells after 90 mins
In DepthDetails ArticlePubMed
TargetMelatonin receptor type 1A(Homo sapiens (Human))
Universit£
Curated by ChEMBL
LigandPNGBDBM50416689(CHEMBL1223052)
Affinity DataKi:  2.75E+3nM. Assay description: Displacement of [125I]iodomelatonin from human cloned MT1 receptor expressed in rat NIH3T3 cells after 90 mins
In DepthDetails ArticlePubMed