BDBM50416744 CHEMBL1242478
SMILES COc1cc2nccc(Oc3ccc4N(CCOc4c3)C(=O)Nc3ccc(Cl)cc3)c2cc1C(C)=O
InChI Key InChIKey=OEEXVTUJQBGEMN-UHFFFAOYSA-N
Data  1 IC50
  Tab Delimited (TSV)   2D SDfile   Computed 3D by Vconf -m prep SDfile
Find this compound or compounds like it in BindingDB:
Activity Spreadsheet -- Enzyme Inhibition Constant Data from BindingDB
Found 1 hit for monomerid = 50416744
TargetVascular endothelial growth factor receptor 2(Homo sapiens (Human))
Lanzhou University
Curated by ChEMBL
LigandPNGBDBM50416744(CHEMBL1242478)
Affinity DataIC50:  0.603nM. Assay description: Inhibition of human VEGFR2 after 60 mins
In DepthDetails ArticlePubMed