BDBM50416827 CHEMBL1241119
SMILES COc1ccc(cc1)C(O)CNN
InChI Key InChIKey=UDMZZPJPUYHYFC-UHFFFAOYSA-N
Data  1 IC50
  Tab Delimited (TSV)   2D SDfile   Computed 3D by Vconf -m prep SDfile
Find this compound or compounds like it in BindingDB:
Activity Spreadsheet -- Enzyme Inhibition Constant Data from BindingDB
Found 1 hit for monomerid = 50416827
TargetMembrane primary amine oxidase(Homo sapiens (Human))
Fi-40014 University Of Jyvaskyla
Curated by ChEMBL
LigandPNGBDBM50416827(CHEMBL1241119)
Affinity DataIC50:  28.8nM. Assay description: Inhibition of human recombinant VAP-1 expressed in CHO cells after 30 mins by coupled colorimetric method
In DepthDetails ArticlePubMed