BDBM50416860 CHEMBL1254829
SMILES COc1cccc(C)c1OCCNCCOc1ccccc1OCc1ccccc1
InChI Key InChIKey=WPQJHJUCAXKHKN-UHFFFAOYSA-N
Data  4 KI
  Tab Delimited (TSV)   2D SDfile   Computed 3D by Vconf -m prep SDfile
Find this compound or compounds like it in BindingDB:
Activity Spreadsheet -- Enzyme Inhibition Constant Data from BindingDB
Found 4 hits for monomerid = 50416860
TargetAlpha-1D adrenergic receptor(Homo sapiens (Human))
Universit£
Curated by ChEMBL
LigandPNGBDBM50416860(CHEMBL1254829)
Affinity DataKi:  0.912nM. Assay description: Displacement of [3H]prazosin from human adrenergic Alpha-1D expressed in CHO cells
In DepthDetails ArticlePubMed
TargetAlpha-1A adrenergic receptor(Homo sapiens (Human))
Universit£
Curated by ChEMBL
LigandPNGBDBM50416860(CHEMBL1254829)
Affinity DataKi:  2.51nM. Assay description: Displacement of [3H]prazosin from human adrenergic alpha1A expressed in CHO cells
In DepthDetails ArticlePubMed
Target5-hydroxytryptamine receptor 1A(Homo sapiens (Human))
Universit£
Curated by ChEMBL
LigandPNGBDBM50416860(CHEMBL1254829)
Affinity DataKi:  3.98nM. Assay description: Displacement of [3H]8-OH-DPAT from human adrenergic 5HT1A expressed in human HeLa cells cells
In DepthDetails ArticlePubMed
TargetAlpha-1B adrenergic receptor(Homo sapiens (Human))
Universit£
Curated by ChEMBL
LigandPNGBDBM50416860(CHEMBL1254829)
Affinity DataKi:  5.01nM. Assay description: Displacement of [3H]prazosin from human adrenergic Alpha-1B expressed in CHO cells
In DepthDetails ArticlePubMed