BDBM50416873 CHEMBL1257454
SMILES COc1ccc(F)cc1C(C)(C)CC(O)(CNc1cccc2nc(C)ccc12)C(F)(F)F
InChI Key InChIKey=OUFQSIUBFDHEQY-UHFFFAOYSA-N
Data  6 IC50  1 EC50
  Tab Delimited (TSV)   2D SDfile   Computed 3D by Vconf -m prep SDfile
Find this compound or compounds like it in BindingDB:
Activity Spreadsheet -- Enzyme Inhibition Constant Data from BindingDB
Found 7 hits for monomerid = 50416873
TargetGlucocorticoid receptor(Homo sapiens (Human))
Bayer Schering Pharma
Curated by ChEMBL
LigandPNGBDBM50416873(CHEMBL1257454)
Affinity DataIC50:  25.1nM. Assay description: Transrepression activity at glucocorticoid receptor-mediated antiinflammatory activity in human THP1 cells assessed as inhibition of LPS-induced IL-8...
In DepthDetails ArticlePubMed
TargetGlucocorticoid receptor(Homo sapiens (Human))
Bayer Schering Pharma
Curated by ChEMBL
LigandPNGBDBM50416873(CHEMBL1257454)
Affinity DataEC50:  25.1nM. Assay description: Transactivation activity at glucocorticoid receptor in human HeLa cells assessed as induction of MMTV promoter activity by luciferase reporter gene a...
In DepthDetails ArticlePubMed
TargetProgesterone receptor(Homo sapiens (Human))
Bayer Schering Pharma
Curated by ChEMBL
LigandPNGBDBM50416873(CHEMBL1257454)
Affinity DataIC50: >1.00E+3nM. Assay description: Binding affinity to human recombinant progesterone receptor expressed in baculovirus infected Sf9 cells
In DepthDetails ArticlePubMed
TargetGlucocorticoid receptor(Homo sapiens (Human))
Bayer Schering Pharma
Curated by ChEMBL
LigandPNGBDBM50416873(CHEMBL1257454)
Affinity DataIC50:  2nM. Assay description: Transrepression activity at glucocorticoid receptor-mediated antiinflammatory activity in human HeLa cells assessed as inhibition of TPA-induced coll...
In DepthDetails ArticlePubMed
TargetMineralocorticoid receptor(Homo sapiens (Human))
Bayer Schering Pharma
Curated by ChEMBL
LigandPNGBDBM50416873(CHEMBL1257454)
Affinity DataIC50: >1.00E+3nM. Assay description: Binding affinity to human recombinant mineralocorticoid receptor expressed in baculovirus infected Sf9 cells
In DepthDetails ArticlePubMed
TargetAndrogen receptor(Homo sapiens (Human))
Bayer Schering Pharma
Curated by ChEMBL
LigandPNGBDBM50416873(CHEMBL1257454)
Affinity DataIC50: >1.00E+3nM. Assay description: Binding affinity to human recombinant androgen receptor expressed in baculovirus infected Sf9 cells
In DepthDetails ArticlePubMed
TargetGlucocorticoid receptor(Homo sapiens (Human))
Bayer Schering Pharma
Curated by ChEMBL
LigandPNGBDBM50416873(CHEMBL1257454)
Affinity DataIC50:  0.631nM. Assay description: Binding affinity to human recombinant glucocorticoid receptor expressed in baculovirus infected Sf9 cells
In DepthDetails ArticlePubMed