BDBM50417080 CHEMBL1234888
SMILES CNCc1cn(CC(=O)Nc2sc3CCCCc3c2C(N)=O)nc1C(C)(C)C
InChI Key InChIKey=ORJNBGRVTFLPLF-UHFFFAOYSA-N
Data  1 EC50
PDB links: 1 PDB ID matches this monomer.
  Tab Delimited (TSV)   2D SDfile   Computed 3D by Vconf -m prep SDfile
Find this compound or compounds like it in BindingDB:
Activity Spreadsheet -- Enzyme Inhibition Constant Data from BindingDB
Found 1 hit for monomerid = 50417080
TargetMetabotropic glutamate receptor 1(Homo sapiens (Human))
Merck Research Laboratories
Curated by ChEMBL
LigandPNGBDBM50417080(CHEMBL1234888)
Affinity DataEC50:  316nM. Assay description: Positive modulation of GluR1
In DepthDetails ArticlePubMed