BDBM50417141 CHEMBL1269981
SMILES Cc1c(Cl)cccc1NC(=O)c1cnc2ccccc2n1
InChI Key InChIKey=SCIBFCFFUQXLCN-UHFFFAOYSA-N
Data  1 Kd
  Tab Delimited (TSV)   2D SDfile   Computed 3D by Vconf -m prep SDfile
Find this compound or compounds like it in BindingDB:
Activity Spreadsheet -- Enzyme Inhibition Constant Data from BindingDB
Found 1 hit for monomerid = 50417141
TargetAlpha-ketoglutarate-dependent dioxygenase FTO(Homo sapiens (Human))TBA
LigandPNGBDBM50417141(CHEMBL5282054)
Affinity DataIC50:  1.72E+3nM
In DepthDetails