BDBM50417270 CHEMBL1271656
SMILES CN1[C@@H](CN(C1=O)c1cccnc1C)C(=O)NCc1cccc(c1Cl)C(F)(F)F
InChI Key InChIKey=XBNBWKDHPVEZON-HNNXBMFYSA-N
Data  1 IC50
  Tab Delimited (TSV)   2D SDfile   Computed 3D by Vconf -m prep SDfile
Find this compound or compounds like it in BindingDB:
Activity Spreadsheet -- Enzyme Inhibition Constant Data from BindingDB
Found 1 hit for monomerid = 50417270
TargetP2X purinoceptor 7(Homo sapiens (Human))
Glaxosmithkline
Curated by ChEMBL
LigandPNGBDBM50417270(CHEMBL1271656)
Affinity DataIC50:  5.01nM. Assay description: Antagonist activity at human recombinant P2X7 receptor expressed in HEK293 cells by ethidium accumulation assay
In DepthDetails ArticlePubMed