BDBM50417553 CHEMBL1631933
SMILES [#6]-[#6](=O)-[#7]-[#6@H]-1-[#6]-[#6]-[#6]-[#6]-[#7]-[#6](=O)-[#6]-[#6@H](-[#7]-[#6](=O)-[#6@H](-[#6]-[#8])-[#7]-[#6](=O)-[#6@H](-[#6]-[#6]-[#6]-[#6]-[#7])-[#7]-[#6](=O)-[#6@H](-[#6]-[#6]-[#6]\[#7]=[#6](/[#7])-[#7])-[#7]-[#6]-1=O)-[#6](=O)-[#7]-[#6@@H](-[#6]-[#6]-[#6]\[#7]=[#6](/[#7])-[#7])-[#6](=O)-[#7]-[#6@@H](-[#6]-[#6]-[#6]-[#6]-[#7])-[#6](=O)-[#7]-[#6@H]-1-[#6]-[#6]-[#6]-[#6]-[#7]-[#6](=O)-[#6]-[#6@H](-[#7]-[#6](=O)-[#6@H](-[#6]-[#6]-[#6](-[#7])=O)-[#7]-[#6](=O)-[#6@H](-[#6]-[#6](-[#7])=O)-[#7]-[#6](=O)-[#6@H](-[#6]-[#6]-[#6]-[#6]-[#7])-[#7]-[#6]-1=O)-[#6](-[#7])=O
InChI Key InChIKey=IUZLWPFADRWPOI-AWSRYXRKSA-N
Data  1 IC50
  Tab Delimited (TSV)   2D SDfile   Computed 3D by Vconf -m prep SDfile
Find this compound or compounds like it in BindingDB:
Activity Spreadsheet -- Enzyme Inhibition Constant Data from BindingDB
Found 1 hit for monomerid = 50417553
TargetNociceptin receptor(MOUSE)
TBA
Curated by ChEMBL
LigandPNGBDBM50417553(CHEMBL1631933)
Affinity DataIC50: >100nM. Assay description: Antagonist activity at NOR in mouse Neuro-2a cells assessed as inhibition of nociceptin-induced ERK phopshorylation administered for 15 mins before n...
In DepthDetails ArticlePubMed