BDBM50417568 CHEMBL1642172
SMILES Cn1cc(c(n1)C(F)(F)F)S(=O)(=O)NC1CCc2cc(Cn3cc(CO)c(n3)C(F)(F)F)ccc12
InChI Key InChIKey=PBXHCAPMGJNCRS-UHFFFAOYSA-N
Data  1 EC50
  Tab Delimited (TSV)   2D SDfile   Computed 3D by Vconf -m prep SDfile
Find this compound or compounds like it in BindingDB:
Activity Spreadsheet -- Enzyme Inhibition Constant Data from BindingDB
Found 1 hit for monomerid = 50417568
TargetGlutamate receptor 2(Homo sapiens (Human))
Merck Research Laboratories
Curated by ChEMBL
LigandPNGBDBM50417568(CHEMBL1642172)
Affinity DataEC50:  1.26E+3nM. Assay description: Modulatory activity at GluA2 receptor LBD
In DepthDetails ArticlePubMed