BDBM50417640 CHEMBL1642398
SMILES OC(=O)[C@@H]1CCCN(CC\C=C(\c2ccccc2F)c2ccccc2OC(F)(F)F)C1
InChI Key InChIKey=SQIPXGAJYDVRLC-FNTDYBJHSA-N
Data  1 KI
  Tab Delimited (TSV)   2D SDfile   Computed 3D by Vconf -m prep SDfile
Find this compound or compounds like it in BindingDB:
Activity Spreadsheet -- Enzyme Inhibition Constant Data from BindingDB
Found 1 hit for monomerid = 50417640
TargetSodium- and chloride-dependent GABA transporter 1(Homo sapiens (Human))
Glaxosmithkline
Curated by ChEMBL
LigandPNGBDBM50417640(CHEMBL1642398)
Affinity DataKi:  52.5nM. Assay description: Displacement of [3H]Tiagabine from human recombinant GAT1 expressed in HEK293 cells by equilibrium binding assay
In DepthDetails ArticlePubMed