BDBM50417669 CHEMBL1643355
SMILES NCc1ccc2c(N)nccc2c1
InChI Key InChIKey=LWDVTRXNUGVQES-UHFFFAOYSA-N
Data  1 IC50
  Tab Delimited (TSV)   2D SDfile   Computed 3D by Vconf -m prep SDfile
Find this compound or compounds like it in BindingDB:
Activity Spreadsheet -- Enzyme Inhibition Constant Data from BindingDB
Found 1 hit for monomerid = 50417669
TargetRho-associated protein kinase 1(Homo sapiens (Human))
Msd
Curated by ChEMBL
LigandPNGBDBM50417669(CHEMBL1643355)
Affinity DataIC50:  7.76E+3nM. Assay description: Inhibition of ROCK-1 by Immobilized metal ion affinity-based fluorescence polarization assay
In DepthDetails ArticlePubMed