BDBM50417706 CHEMBL1643602
SMILES CCCCNCc1ccc(cc1)-c1cc(CN(C2CCCC2)S(=O)(=O)c2ccc(OC)cc2)ccc1F
InChI Key InChIKey=QCJJHPGAMUPDQY-UHFFFAOYSA-N
Data  1 KI
  Tab Delimited (TSV)   2D SDfile   Computed 3D by Vconf -m prep SDfile
Find this compound or compounds like it in BindingDB:
Activity Spreadsheet -- Enzyme Inhibition Constant Data from BindingDB
Found 1 hit for monomerid = 50417706
TargetVasopressin V1b receptor(Homo sapiens (Human))
Glaxosmithkline
Curated by ChEMBL
LigandPNGBDBM50417706(CHEMBL1643602)
Affinity DataKi:  1.00E+3nM. Assay description: Antagonist activity at recombinant V1b receptor expressed in CHO cells assessed as inhibition of vasopressin-induced calcium release after 10 mins by...
In DepthDetails ArticlePubMed