BDBM50417986 CHEMBL1672131
SMILES CN(C)c1ccc(CNC(=O)N[C@H]2C[C@@H]2c2ccccc2)cc1
InChI Key InChIKey=TZFDVQWMLQOJIG-MSOLQXFVSA-N
Data  1 IC50
  Tab Delimited (TSV)   2D SDfile   Computed 3D by Vconf -m prep SDfile
Find this compound or compounds like it in BindingDB:
Activity Spreadsheet -- Enzyme Inhibition Constant Data from BindingDB
Found 1 hit for monomerid = 50417986
TargetBifunctional epoxide hydrolase 2(Homo sapiens (Human))
Dainippon Sumitomo Pharma
Curated by ChEMBL
LigandPNGBDBM50417986(CHEMBL1672131)
Affinity DataIC50:  30.2nM. Assay description: Inhibition of human soluble epoxide hydrolase in cell free system
In DepthDetails ArticlePubMed